fa

error: RPC failed; HTTP 413 curl 22 The requested URL returned error: 413 Request Entity Too Large

git首次提交代码到远程仓库提示413错误,错误信息如下 git push --set-upstream origin master Enumerating objects: 153, done. Counting objects: 100% (153/153), done. Delta compression using up to 4 threads Compressing objects: ... »

andriod学习   RecyclerView (瀑布流 waterfall)

andriod学习 RecyclerView (瀑布流 waterfall)

教程:简书 Tyhoo_Wu RecyclerView 总结教程andriod RecyclerView 官方教程需要item.xml、对象类、对象适配器Adapter类、以及此项目用到的展示类Fragement.1.item.xml设计自定义格式 2.对象适配器Adapter类package com.example.example1.mywe »

开始动画

C++贪吃蛇代码的阅读笔记(二):Startinterface开始动画的实现

1. 原理解释 先来看下头文件中包含哪些东西,包括容器deque、vector,以及之前介绍过的Point类,Point声明的对象,主要就是负责控制台上点信息的打印和清除,后面的具体实现部分中也会使用其Print()和Clear()成员函数,没看过的小伙伴,可以先去浏览下面这个地址: https://blog.csdn.net/AnDiXL/article/details/105148754 开头... »

在这里插入图片描述

fastjson和jackson序列化数据的区别

fastjson和jackson序列化数据的区别直奔主题一言不合就上代码注意 直奔主题 1、fastjson将字符串反序列化为对象时,只会处理第一层,内部会序列化为JsonObject或者JsonArray,使用二级结构和三级结构时还要再次处理, 优点就是快,特别快。 2、jackson会将深层字符串一起序列化 一言不合就上代码 public class Demo { public static ... »

在这里插入图片描述

新手推荐:安装Anaconda3+tensorflow+keras+dlib+face_recognition

最近在搞这个东西,虽然网上推荐方法多得数不过来,适合新手的却廖廖而且都是坑,先简单说一下,安装这些东西,都有对应的版本,有几个版本需要相互匹配对应,否则全是错误。对于新手而言,最好方法就是从头一步到位。 一、首先安装anaconda3 官网地址:https://www.anaconda.com/distribution/,下载python3.7版本的,记得,python2和python3还是有区别... »

rsync远程同步报错:ERROR: auth failed on module www rsync error: error starting client-server protocol (cod

错误描述 [root@localhost ~]# rsync -avz --delete backuper@192.168.20.115::www /www Password: @ERROR: auth failed on module www rsync error: error starting client-server protocol (code 5) at main.c(1516) [... »

详解mpaas离线包pushWindow方法的两个参数defaultTitle和readTitle在iOS客户端代码执行流程以及自定义导航条之后的适配方法(三)

详解mpaas离线包pushWindow方法的两个参数defaultTitle和readTitle在iOS客户端代码执行流程以及自定义导航条之后的适配方法(三)

上篇这个方法传入的时候已经有maintitle值了-[H5NavigationTitleView setMainTitle:subtitle:] 然后看下它的上个方法 -[NBPlugin4NavigationTitleView handleEvent:] r14 = [@"scene.titleView.title.set" isEqualToString:rdx]; [rbx release]... »

201712-4 ccf c++实现,dijkstra,spfa算法

题目就不粘贴了 思路:用sum,ans数组分别存储1号结点到每个节点连续走小路的路程,以及1号结点到每个结点的最终疲惫值,疲惫值的计算为如果当前走的是小路,则更新疲惫值以及累计走的小路总和,ans的更新规则为上一结点的疲惫值减去之前走小路累计的疲惫值,然后再加上当前走小路的疲惫值,即 ans[ne]=ans[nn]-sum[nn]sum[nn]+(sum[nn]+next.v)(sum[nn]+n... »

在这里插入图片描述

prometheus + node_exporter + grafana监控平台搭建

最近由于工作上的安排,我们产品的运维工作也落到了我头上,接手发现很多运维工作方式比较原始,尤其时在监控方面的欠缺,使得我们处于很被动的局面,所以想着搭建一套监控系统;在做监控平台选型时,比来比去决定还是用prometheus来搭建我们的监控平台,基于我们做这个决定的原因主要有如下几点: 社区活跃,很多人都在用 prometheus属于一站式监控告警平台,依赖少,功能齐全。 prometheus支持... »

faster-rcnn代码阅读notes—1

VOC数据读入 数据读入方法:ImageSets/Main/mode.txt中存放mode对应的数据编号,然后到Annotations/id.xml里读bbox的xml文件,再到JPEGImages/id.jpg里读jpg文件 id.strip() for id in open(file) 获得id列表 xml文件读入方法 import xml.etree.ElementTree as ET fi... »

Tensorflow 2.1训练 实战 cifar10 完整代码 准确率 88.6% 模型 Resnet SENet Inception

环境: tensorflow 2.1 最好用GPU 模型: Resnet:把前一层的数据直接加到下一层里。减少数据在传播过程中过多的丢失。 SENet: 学习每一层的通道之间的关系 Inception: 每一层都用不同的核(1×1,3×3,5×5)来学习.防止因为过小的核或者过大的核而学不到图片的特征。 用Resnet ,SENet, Inceptiont网络训练Ci... »

在这里插入图片描述

docker容器中 bash: vi: command not found,docker apt-get 异常 Temporary failure resolving

bash: vi: command not found, 场景: 因为 docker里面没有这个命令,我们安装一下 apt-get update apt-get install vim 如果 这个时候 安装也还是会出现 异常 root@446d7cf1606c:/etc/mysql# apt-get update Err:1 http://security.debian.org/debian-se... »

在这里插入图片描述

fatal: early EOF fatal: index-pack failed

使用git clone 克隆代码时出现以下报错,这个一般是由于代码仓库太大,而本地网络不是很稳定都可以造成以下问题 解决方法如下 方法一: 1、关闭compression $ git config --global core.compression 0 2、做一个部分克隆来截断下来的信息量 $ git clone --depth 1 3、转到新目录并检索克隆的其余部分 $ git fetch --... »

iOS 打包失败 IPA processing failed

0x00 架构问题某些第三方SDK中包含了i386 x86_64架构,iOS13苹果取消了32位系统的支持其实去掉x86_64就可以打包成功了0x01方法:使用终端cd到第三库的文件夹使用命令:lipo -remove x86_64 xxx -o lib如果是xxx.a进入到xxx.a所在文件夹lipo -remove x86_64 xxx.a -o lib.a如果是xxx.framework则要... »

运行结果

解决pip安装opencv遇到的from .cv2 import * ImportError: DLL load failed: 找不到指定的模块>>>问题(亲测)

报错如下: 倔强青铜 折腾了好久,了解到一个原因是python版本与opencv版本不匹配导致找不到模块,所以从清华的镜像 https://pypi.tuna.tsinghua.edu.cn/simple/opencv-python/ 中下载其他版本的库,因为电脑里python是3.6.10版本的,所以下载了opencv_python-3.2.0.7-cp36-cp36m-win_amd64.wh... »

5G无线驱动出现“kick out msg fail”的解决方法

今天在调测程序时周期性的规律性的蹦出 kick out msg fail 字样。同时伴随着设备卡死,网络中断,无法交互,无法重启等情况。检查内核代码并没有发现什么问题。后来回溯版本发现是因为另一个程序不严谨,意外重置了5g通信相关的引脚导致的。重写代码规避了引脚及端口操作从此再没出现kick out msg fail报错作者:伍铭 »

在这里插入图片描述

module ‘tensorflow’ has no attribute ‘get_default_graph’

参考:https://blog.csdn.net/u014466109/article/details/88877321?depth_1-utm_source=distribute.pc_relevant.none-task&utm_source=distribute.pc_relevant.none-task 事件经过: 现在已经是凌晨一点半,从昨天下午开始在 windows 的 ana... »

在这里插入图片描述

人脸识别之win10安装opencv、Dlib、facerecognition

记录贴,纯方法 目的:在python下安装opencv库和face reconfig库 首先下载Anconda3,可以用来进行一下操作 https://www.anaconda.com/distribution/,视情况下载 不介绍详细操作,只放关键步骤 安装成功后运行 进入后先在里面安装python 查询版本: conda search "^python$" 创建虚拟空间存放python: co... »

JSONException:com.alibaba.fastjson.JSONException: expect ‘:’ at 0, actual = 已解决

JSONException:com.alibaba.fastjson.JSONException: expect ‘:’ at 0, actual = 已解决

报错内容:  expect ‘:’ at 0, actual =  com.alibaba.fastjson.JSONException: expect ‘:’ at 0, actual = 原因: 该异常为运行时异常,一定不是语法错误。 意思是JSONEObject转换异常,通常为fromObject() 方法位置报错。 检查你代码的 JSONEO... »

Tensorflow 2.1 keras 训练 实战 cifar10 cifar100 准确率 可达86%-87% 模型 Resnet Senet

环境: tensorflow 2.1 最好用GPU 模型: Resnet SENet 用Resnet 和SENet网络训练Cifar10 或者Cifar 100. 训练数据:Cifar10 或者 Cifar 100 准确率:可达86%-87% 训练时间在GPU上:一小时多 权重大小:5.08 MB 训练的历程: 普通网络(65%左右)-> 数据增强(70%左右)->模型增强(进入Res... »

Python3之接口类(InterfaceClass)浅谈

日期:2020年3月14日 作者:Commas 注释:学习就是为了忘记,什么是接口类,怎么将方法变为属性; 如果您想了解更多有关Python的知识,那么请点《我的Python浅谈系列目录》 文章目录一、接口类的定义与作用二、图形的接口类示例三、@property让方法秒变“属性” 一、接口类的定义与作用 接口类实际上就是一个规范子类的类,只不过这个类与别的类不太一样,接口(内部的方法)本身不实现,... »

在这里插入图片描述

【Java基础】Java8新特性—接口中使用default和static关键字

目录一.新特性二.defalut方法三.static方法 接口中的变量默认类型是public static final,也是就是说是 公有静态常量 。 而方法默认是public abstract,公有抽象方法,但是事实真的是这样吗? 一.新特性 Java 1.8对接口有两个方面的增强:接口中可以添加使用default或者static修饰的方法 增加default方法:又叫做接口扩展方法,即在不破坏... »

ld: symbol(s) not found for architecture x86_64 clang: error: linker command failed with exit code 1

今天编写一个简单的代码,报错了:templateclass matrix final}inline const uint32_t size() constT* operator[] const~matrix()free;}private:const uint32_t SIZE;T** _data;};改为编译语句为::gcc -lstdc++ -std=c++11 main.cc -o main解... »

在这里插入图片描述

PyCharm出现Error loading package list:Request failed with status code 403怎么解决

今天我在做东西出现了Error loading package list:Request failed with status code 403这个问题。解决方法 :1.点击settings,然后点击下图中Project Interpreter2.点击右边加号 ,点击Manage Repositories,将源换成清华源即可,将原有源删除,清华源和原有源不要一起用,俩者删其一。 »

在这里插入图片描述

Ubuntu配置fastfds时报错error:request for member ‘path’ in something not a structure or union

具体报错信息make 出现的/common.c:1088:42: error: request for member ‘path’ in something not a structure or union pStorePaths->paths[store_path_index].path,解决办法需要将FastDFS升级到v6.03及以上版本,建议使用v6.04。 »

Page 1 of 24123»