error

在这里插入图片描述

[解决方案] Scrapy 安装时遇到:Running setup.py install for Twisted … error 解决方案

本文给出安装Scrapy时遇到:Running setup.py install for Twisted … error错误的解决方案。 1.错误描述 安装Scrapy爬虫框架时经常会遇到Running setup.py install for Twisted … error的错误 2.解决方法 2.1 通过 pip 检查工具检查接受安装的标签 具体方法如下:进入Python环境输入如下命令: &... »

在这里插入图片描述

安装tensorflow运行出错 ERROR:root:Internal Python error in the inspect module

导入模块,运行出现以下错误使用pip install tensorflow 默认安装的是tensorflow 2.0往下拉可以看到各种: ImportError: DLL load failed: 找不到指定的模块查看官网可以看到相关说明卸载最新的tensorflow 2.0pip uninstall tensorflow -y安装tensorflow1. »

在这里插入图片描述

树莓派4B使用 Adafruit_PCA9685 报错IOError: [Errno 121] Remote I/O error解决办法

树莓派4B使用 Adafruit_PCA9685 报错IOError: [Errno 121] Remote I/O error解决办法 首先,确保已经下载了python2或python3的Adafruit_PCA9685库,然后要明白,报该错原因是:Adafruit_PCA9685无法找到外部的硬件,所以认为你没有打开I2C权限(当然,一定要先打开I2C权限),然后错误通常为以下格式 File ... »

使用本地aar依赖出现AGPBI: {“kind”:”error”,”text”:”Program type already present: 问题

使用本地aar依赖出现AGPBI: {“kind”:”error”,”text”:”Program type already present: 问题 公司app有一个模块是外包给别人做的,别人用hbuilder做好后,打包成aar的形式给我,调用后,调试模式直接安装到手机上没问题,打debug也没问题,但是打rel... »

error: RPC failed; HTTP 413 curl 22 The requested URL returned error: 413 Request Entity Too Large

git首次提交代码到远程仓库提示413错误,错误信息如下 git push --set-upstream origin master Enumerating objects: 153, done. Counting objects: 100% (153/153), done. Delta compression using up to 4 threads Compressing objects: ... »

在这里插入图片描述

Android.bp编译提示ninja: error: unknown target ‘MODULES-IN-xxx’终极指南

Android.bp编译提示ninja: error: unknown target ‘MODULES-IN-xxx’终极指南 前言    当我们通过Android.bp编译脚本构建App或者bin执行文件时,可能会莫名的提示ninja: error: unknown target ‘MODULES-IN-paxdroid-external-AndroidBp’的错误,那么... »

rsync远程同步报错:ERROR: auth failed on module www rsync error: error starting client-server protocol (cod

错误描述 [root@localhost ~]# rsync -avz --delete backuper@192.168.20.115::www /www Password: @ERROR: auth failed on module www rsync error: error starting client-server protocol (code 5) at main.c(1516) [... »

Linux从error while loading shared libraries: libxxx.so.x 错误的常规解决思路看程序与动态库的关系

3 解决方案**现象:**在终端运行程序 如,wireshark;出现报错:error while loading shared libraries: libGL.so.1;关键字: libGL.so.1解决办法:找到程序wireshark所在路径;sudo find / -name wireshark找到库libGL.so.1所在路径;sudo ldd /usr/bin/wireshark | ... »

rsync实时同步报错error: some files/attrs were not transferred (see previous errors)解决

一、故障现象 执行rsync同步时出现以下报错 [root@client abc]# rsync -azH --delete --password-file=/etc/server.pass /opt/abc/ backuper@192.168.5.129::wwwroot rsync: failed to set times on "/." (in wwwroot): Operation not... »

在这里插入图片描述

Markdown : An error occurred with the Html rendering component

win10系统上安装Markdown时提示错误可以在软件商店或者网上找到markdown软件,下载安装后打开却出现了以下错误,应该是MarkdownPad 2 在win10下 出现HTML 渲染错误 的问题。安装一个SDK的工具包:下载地址下载之后运行安装包,然后按照下图所示的步骤,无特殊说明的就一路Next。选择I accept the terms in the…安装完成,点击finish。然后... »

maven打包提示 警告: @param 没有说明

需要添加一个系统变量,待完善。问题产生的原因应该是,mvn拿到的javaHome位置应该是$/jre而不是jdk位置作者:只是一只小小鸟 »

运行Shell文件.sh报错syntax error near unexpected token `$’do\r”

问题 运行 sh start.sh,出现报错 start.sh: line 17: syntax error near unexpected token `$'do\r'' 'tart.sh: line 17: ` do 原因 运行cat -v start.sh,如果内容结尾为是^M,这是因为你所处理的文件换行符是dos格式的”\r\n”,你可能在windows下编辑过内容... »

在这里插入图片描述

QT QGC 中 QGCTileCacheWorker.cpp:728: error: C2220: 警告被视为错误 – 没有生成“object”文件

目录1. 已搭建环境介绍2. 解决办法3. 大功告成1. 已搭建环境介绍按官网推荐已搭建好的环境:VS2017 + QT5.12.6 + QGC4.0稳定版QGC源码最好是git下载的,zip后+GPS和mavlink不好使这里不再累赘。 »

爬取内容

Python爬虫实战 _豆瓣电影TOP250(2)爬取详细数据,保存为CSV文件【urllib、request、bs4、error、CSV】

爬取时间:2020-03-12 爬取难度:★★☆☆☆☆ 请求链接:https://movie.douban.com/top250 以及每部电影详情页,图片 爬取目标:爬取榜单上每一部电影详情页的数据,保存为 CSV 文件 涉及知识:request、urllib、bs4、CSV 和二进制数据储存、列表操作 爬取豆瓣Top250一、循环爬取网页模板二、解析与处理模块1、BeautifulSoup解析电... »

ld: symbol(s) not found for architecture x86_64 clang: error: linker command failed with exit code 1

今天编写一个简单的代码,报错了:templateclass matrix final}inline const uint32_t size() constT* operator[] const~matrix()free;}private:const uint32_t SIZE;T** _data;};改为编译语句为::gcc -lstdc++ -std=c++11 main.cc -o main解... »

在这里插入图片描述

Ubuntu配置fastfds时报错error:request for member ‘path’ in something not a structure or union

具体报错信息make 出现的/common.c:1088:42: error: request for member ‘path’ in something not a structure or union pStorePaths->paths[store_path_index].path,解决办法需要将FastDFS升级到v6.03及以上版本,建议使用v6.04。 »

在这里插入图片描述

Android高版本源码编译提示error: cannot find symbol import android.os.SystemProperties

cannot find symbol import android.os.SystemProperties 前言   最近在搞Android高版本的9和10开发,正在敲着代码唱着歌,发现在Android源码目录的app下面导入import android.os.SystemProperties这个包老是不行,尼玛搞得我怀疑人生了啊。这个我咋在Android源码下面通过Android.mk老是编译不... »

在这里插入图片描述

用HEdit解决因修改用户文件夹名在打开pip时遇到Fatal error in launcher: Unable to create process using 的问题

在修改了管理员用户文件夹名字之后。(之前是中文名,用超级管理员改成英文名之后)调用pip命令时,出现了下图所示的问题: 无法打开pip程序 首先我们要知道pip程序一般在哪? 一般是在C:\Users\…\AppData\Local\Programs\Python\Python37\Scripts中,在这个文件夹下面有个pip.py或者pip应用程序,如果有pip.py的话直接打开修改其中的路径即... »

CentOS6挂载linux7samba服务时报错:mount error(22): Invalid argument Refer to the mount.cifs(8) manual page (

查看samba的版本是4版本的: [root@redhat_192.168.0.12 16:08:07 ~]#rpm -qa samba samba-4.9.1-6.el7.x86_64 找了好久,百度上一直都是mount命令加各种参数,确认了用户跟密码都没有问题,目录权限也都给了,最后是使用下面的办法解决的。 在/etc/fstab的挂载配置里面添加参数sec=ntlmssp,如下: //hah... »

idea spark编译出现error:object Apache is not a member of package org

idea spark编译出现error:object Apache is not a member of package org

在创建一个maven工程后将工程打成jar包时出现如下错误再三确认pom.xml文件无误后,只能逐个排除问题,最后发现有可能是因为maven仓库的路径存在中文问题解决方法,复制.m2文件到没有空格没有中文的路径下,重新指定maven的仓库好了成功解决。 »

在这里插入图片描述

python安装torch时遇到 ERROR: Command errored out with exit status 1:

python安装torch时遇到 ERROR: Command errored out with exit status 1:之前用pycharm运行github上一个模型时,遇到了import torch失败的问题,而且用pip安装失败。下载torch根据我们刚刚查的python版本与位数去torch官网下载对应版本的torch。这里可以选择自己需要的版本,我们直接复制Run this Comm... »

在这里插入图片描述

pip 安装报错 error: Microsoft Visual C++ 14.0 is required. Get it with “Microsoft Visual C++ Build Tools

在 Windows 安装 python 包经常会遇到这错误: error: Microsoft Visual C++ 14.0 is required. Get it with “Microsoft Visual C++ Build Tools 遇到这错误不要慌, 进这个网站下载对应的 whl 包即可。 https://www.lfd.uci.edu/~gohlke/pythonlib... »

在这里插入图片描述

An error occurred while creating the AVD-Android studio

Android studio模拟器无法创建,一开始以为是SDK Manager没设置好,百般尝试无果,后来还尝试BIOS里设置Virtual Technology enabled,后来发现不是这个原因。弄了一下午终于找到解决方法了,特此分享!!!废话不多说方法就是1.安装*腾讯手游助手*,打开,等它的游戏引擎安装完成后,2.打开Android studio,选择设备型号时的右下角的错误由unkno... »

在这里插入图片描述

Python 3 最新有道翻译爬取,破解反爬机制,解决{“errorCode”:50}错误

文章目录问题有人说:需要修改URL继续完成完美的爬取!附上python3爬取完美代码:补充说明 问题 因为有道翻译有反爬机制,所以简单的爬肯定不行,最近用Python3 写了一个爬虫程序…… 然而,返回结果却是{“errorCode”:50},百感交集。 有人说:需要修改URL 我的URL:http://fanyi.youdao.com/translate_o?smartresult=dict&a... »

LoadRunner出现error问题及解决方法总结

  一、Step download timeout(120 seconds)   这是一个经常会遇到的问题,解决得办法走以下步骤:   1、修改run time setting中的请求超时时间,增加到600s,其中有三项的参数可以一次都修改了,HTTP-request connect timeout,HTTP-request receieve timeout,Step download timeo... »

Page 1 of 8123»